Target
Endothelin-converting enzyme 1
Ligand
BDBM21653
Substrate
BDBM21661
Meas. Tech.
In Vitro Inhibition of NEP
Ki
26±n/a nM
Citation
 Inguimbert, NCoric, PPoras, HMeudal, HTeffot, FFournié-Zaluski, MCRoques, BP Toward an optimal joint recognition of the S1' subsites of endothelin converting enzyme-1 (ECE-1), angiotensin converting enzyme (ACE), and neutral endopeptidase (NEP). J Med Chem 45:1477-86 (2002)  
Target
Name:
Endothelin-converting enzyme 1
Synonyms:
ECE-1 ECE1_HUMAN Endothelin-converting enzyme 1 (ECE1)
Type:
Enzyme
Mol. Mass.:
87155.11
Organism:
Homo sapiens (Human)
Description:
P42892
Residue:
770
  
Inhibitor
Name:
BDBM21653
Synonyms:
(2S)-2-[(2R)-2-[(1R)-2,3-dihydro-1H-inden-1-yl]-3-sulfanylpropanamido]-3-(1H-indol-3-yl)propanoic acid Mercaptoacyl amino acid compound, 13b
Type:
Small organic molecule
Emp. Form.:
C23H24N2O3S
Mol. Mass.:
408.513
SMILES:
OC(=O)[C@H](Cc1c[nH]c2ccccc12)NC(=O)[C@H](CS)[C@H]1CCc2ccccc12
:
Substrate
Name:
BDBM21661
Synonyms:
Ac-Ile-Ile-Pya-Nop-Asn-Thr-Pro-Glu-His-Val-Val-Pro-Tyr-Gly-Leu-Gly-Ser-COOH Pya(21)-Nop(22)-bET-1(19--35), Pra= pyrenylalanine, Nop=p-nitrophenylalanine
Type:
Emp. Form.:
Mol. Mass.:
SMILES:
: