Target
Dimer of Gag-Pol polyprotein [489-587]
Ligand
BDBM200
Substrate
fluorogenic peptide substrate
Meas. Tech.
Protease Inhibition Assay
pH
4.7±n/a
Temperature
303.15±n/a K
Ki
0.004±n/a nM
Comments
Citation
 Madhusoodan, VHosur, TNarayana, BKempf, DJBaldwin, ETLiu, BSGulnik, SWideburg, NENorbeck, DWAppelt, KErickson, JW INFLUENCE OF STEREOCHEMISTRY ON ACTIVITY AND BINDING MODES FOR C(2) SYMMETRY-BASED DIOL INHIBITORS OF HIV-1 PROTEASE. J Am Chem Soc 116:847-55 (1994)    Article 
Target
Name:
Dimer of Gag-Pol polyprotein [489-587]
Synonyms:
HIV-1 Protease
Type:
Protein Complex
Mol. Mass.:
Description:
Components:
This complex has 2 components.
Component 1
Name:
Gag-Pol polyprotein [489-587]
Synonyms:
HIV protease HIV-1 Protease chain A POL_HV1N5 | gag-pol
Type:
Enzyme Subunit
Mol. Mass.:
10822.21
Organism:
Human immunodeficiency virus type 1
Description:
P12497[489-587]
Residue:
99
  
Component 2
Name:
Gag-Pol polyprotein [489-587]
Synonyms:
HIV protease HIV-1 Protease chain A POL_HV1N5 | gag-pol
Type:
Enzyme Subunit
Mol. Mass.:
10822.21
Organism:
Human immunodeficiency virus type 1
Description:
P12497[489-587]
Residue:
99
  
Inhibitor
Name:
BDBM200
Synonyms:
(2S)-N-[(2S,3R,5S)-3-hydroxy-5-[(2S)-3-methyl-2-{[methyl(pyridin-2-ylmethyl)carbamoyl]amino}butanamido]-1,6-diphenylhexan-2-yl]-3-methyl-2-{[methyl(pyridin-2-ylmethyl)carbamoyl]amino}butanamide | A-78791
Type:
Emp. Form.:
C44H58N8O5
Mol. Mass.:
778.9819
SMILES:
CC(C)[C@H](NC(=O)N(C)Cc1ccccn1)C(=O)N[C@H](C[C@@H](O)[C@H](Cc1ccccc1)NC(=O)[C@@H](NC(=O)N(C)Cc1ccccn1)C(C)C)Cc1ccccc1
:
Substrate
Name:
fluorogenic peptide substrate
Synonyms:
Type:
fluorogenic peptide
Mol. Mass.:
3550.86
Organism:
Description:
Residue:
33