Target
Cathepsin D
Ligand
BDBM29777
Substrate
Fluorescent Substrate
Meas. Tech.
Enzyme Inhibition Assay
IC50
890±n/a nM
Citation
 Charrier, NClarke, BDemont, EDingwall, CDunsdon, RHawkins, JHubbard, JHussain, IMaile, GMatico, RMosley, JNaylor, AO'Brien, ARedshaw, SRowland, PSoleil, VSmith, KJSweitzer, STheobald, PVesey, DWalter, DSWayne, G Second generation of BACE-1 inhibitors part 2: Optimisation of the non-prime side substituent. Bioorg Med Chem Lett 19:3669-73 (2009)  
Target
Name:
Cathepsin D
Synonyms:
CATD_HUMAN CTSD Cathepsin D heavy chain Cathepsin D precursor
Type:
Enzyme
Mol. Mass.:
44551.72
Organism:
Homo sapiens (Human)
Description:
Human proCathepsin D (SwissProt accession number P07339) was expressed in Sf9 cells, purified, and autoactivated.
Residue:
412
  
Inhibitor
Name:
BDBM29777
Synonyms:
7,6,5 tricyclic sulfonamide, 15 | BMCL193674 Compound 8
Type:
Small organic molecule
Emp. Form.:
C27H33F3N4O4S
Mol. Mass.:
566.636
SMILES:
CCc1cn2CCS(=O)(=O)N(C)c3cc(cc1c23)C(=O)N[C@@H](Cc1ccccc1)[C@H](O)CNCCC(F)(F)F
:
Substrate
Name:
Fluorescent Substrate
Synonyms:
Type:
Peptide
Mol. Mass.:
2030.30
Organism:
Description:
Residue:
18
FAMSEVNLDAEFKTAMRA