Target
Tyrosine-protein kinase BTK
Ligand
BDBM264386
Substrate
Meas. Tech.
Kinase Assays
IC50
<100.0±n/a nM
Citation
 Zeng, QFaris, MMollard, AWarner, SLFlynn, GA Multiple kinase pathway inhibitors US Patent  US9714247 Publication Date 7/25/2017 
Target
Name:
Tyrosine-protein kinase BTK
Synonyms:
AGMX1 Agammaglobulinaemia tyrosine kinase B cell progenitor kinase BPK BTK_HUMAN Tyrosine Kinase BTK Tyrosine-protein kinase BTK (BTK)
Type:
Enzyme
Mol. Mass.:
76289.95
Organism:
Homo sapiens (Human)
Description:
Q06187
Residue:
659
  
Inhibitor
Name:
BDBM264386
Synonyms:
US9714247, 107
Type:
Small organic molecule
Emp. Form.:
C28H30F3N5O2
Mol. Mass.:
525.5653
SMILES:
CCN(CC)CCOc1ccc(Nc2cc3n(CC)c(=O)c(cc3cn2)-c2ccccc2C(F)(F)F)nc1
: