Target
Tyrosine-protein phosphatase non-receptor type 7
Ligand
BDBM46146
Substrate
Meas. Tech.
Fluorescent secondary assay for dose-response confirmation of chemical inhibitors of HePTP
IC50
220±n/a nM
Citation
 PubChem, PC Fluorescent secondary assay for dose-response confirmation of chemical inhibitors of HePTP PubChem Bioassay (2009)[AID] 
Target
Name:
Tyrosine-protein phosphatase non-receptor type 7
Synonyms:
He-PTP Hematopoietic protein-tyrosine phosphatase (HEPTP) PTPN7 Tyrosine-protein phosphatase non-receptor type 7 | Tyrosine-protein phosphatase non-receptor type 7 (HEPTP)
Type:
Protein
Mol. Mass.:
40530.79
Organism:
Homo sapiens (Human)
Description:
P35236
Residue:
360
  
Inhibitor
Name:
BDBM46146
Synonyms:
7-hexacosenoic acid cid_16654691 | hexacos-7-enoic acid
Type:
Small organic molecule
Emp. Form.:
C26H50O2
Mol. Mass.:
394.674
SMILES:
CCCCCCCCCCCCCCCCCCC=CCCCCCC(O)=O
: