Target
Neutrophil cytosol factor 1 [S99G]
Ligand
BDBM55372
Substrate
Meas. Tech.
Dose Response Confirmation for small molecular inhibitors for p47phox, a regulatory protein of NADPH oxidases (Noxs)
IC50
50000±n/a nM
Citation
 PubChem, PC Dose Response Confirmation for small molecular inhibitors for p47phox, a regulatory protein of NADPH oxidases (Noxs) PubChem Bioassay (2008)[AID] 
Target
Name:
Neutrophil cytosol factor 1 [S99G]
Synonyms:
NCF1 NOXO2 neutrophil cytosolic factor 1
Type:
Enzyme Catalytic Domain
Mol. Mass.:
44664.39
Organism:
Homo sapiens (Human)
Description:
gi_115298672
Residue:
390
  
Inhibitor
Name:
BDBM55372
Synonyms:
(4-tert-Butyl-phenyl)-piperazin-1-yl-methanone (4-tert-butylphenyl)-piperazin-1-yl-methanone;hydrochloride (4-tert-butylphenyl)-piperazino-methanone;hydrochloride SMR000115860 | cid_2860295
Type:
Small organic molecule
Emp. Form.:
C15H22N2O
Mol. Mass.:
246.348
SMILES:
CC(C)(C)c1ccc(cc1)C(=O)N1CCNCC1
: