Target
D(3) dopamine receptor
Ligand
BDBM81794
Substrate
Ki
15±n/a nM
Comments
PDSP_474
Citation
 Sokoloff, PGiros, BMartres, MPAndrieux, MBesancon, RPilon, CBouthenet, MLSouil, ESchwartz, JC Localization and function of the D3 dopamine receptor. Arzneimittelforschung 42:224-30 (1992) Target
Name:
D(3) dopamine receptor
Synonyms:
DOPAMINE D3 DRD3_HUMAN Dopamine D3 receptor (D3) Dopamine receptor Dopamine receptor D3
Type:
Mol. Mass.:
44243.43
Organism:
Homo sapiens (Human)
Description:
Residue:
400
  
Inhibitor
Name:
BDBM81794
Synonyms:
CAS_5942-95-0 NSC_2580
Type:
Small organic molecule
Emp. Form.:
C28H38N4O
Mol. Mass.:
446.6275
SMILES:
NC(=O)C1(CCN(CCCN2c3ccccc3CCc3ccccc23)CC1)N1CCCCC1
: