Target
Alpha-2C adrenergic receptor
Ligand
BDBM81818
Substrate
Ki
5200±n/a nM
Comments
PDSP_2651
Citation
 Garritsen, AIjzerman, APTulp, MTCragoe, EJSoudijn, W Receptor binding profiles of amiloride analogues provide no evidence for a link between receptors and the Na+/H+ exchanger, but indicate a common structure on receptor proteins. J Recept Res 11:891-907 (1991)  
Target
Name:
Alpha-2C adrenergic receptor
Synonyms:
ADA2C_RAT Adrenergic receptor alpha adrenergic Alpha2 | adrenergic Alpha2C
Type:
Enzyme Catalytic Domain
Mol. Mass.:
49890.50
Organism:
RAT
Description:
adrenergic Alpha2 0 RAT::P22086
Residue:
458
  
Inhibitor
Name:
BDBM81818
Synonyms:
CAS_1794 HMA | NSC_1794
Type:
Small organic molecule
Emp. Form.:
C12H18ClN7O
Mol. Mass.:
311.771
SMILES:
NC(=N)NC(=O)c1nc(Cl)c(nc1N)N1CCCCCC1
: