Target
Muscarinic acetylcholine receptor M2
Ligand
BDBM81818
Substrate
Ki
2900±n/a nM
Comments
PDSP_2651
Citation
 Garritsen, AIjzerman, APTulp, MTCragoe, EJSoudijn, W Receptor binding profiles of amiloride analogues provide no evidence for a link between receptors and the Na+/H+ exchanger, but indicate a common structure on receptor proteins. J Recept Res 11:891-907 (1991)  
Target
Name:
Muscarinic acetylcholine receptor M2
Synonyms:
ACM2_RAT Chrm-2 | Chrm2
Type:
Enzyme Catalytic Domain
Mol. Mass.:
51555.53
Organism:
RAT
Description:
P10980
Residue:
466
  
Inhibitor
Name:
BDBM81818
Synonyms:
CAS_1794 HMA | NSC_1794
Type:
Small organic molecule
Emp. Form.:
C12H18ClN7O
Mol. Mass.:
311.771
SMILES:
NC(=N)NC(=O)c1nc(Cl)c(nc1N)N1CCCCCC1
: