Target
5-hydroxytryptamine receptor 2A
Ligand
BDBM50035057
Substrate
Ki
1700±n/a nM
Comments
PDSP_779
Citation
 Schipper, JTulp, MTSijbesma, H Neurochemical profile of eltoprazine. Drug Metabol Drug Interact 8:85-114 (1990)  
Target
Name:
5-hydroxytryptamine receptor 2A
Synonyms:
5-HT-2A 5-HT2A 5-hydroxytryptamine receptor 2A (5HT2A) Htr2 Serotonin Receptor 2A
Type:
G Protein-Coupled Receptor (GPCR)
Mol. Mass.:
52852.05
Organism:
Rattus norvegicus (rat)
Description:
Rat cortex membranes 5-HT2A receptors.
Residue:
471
  
Inhibitor
Name:
BDBM50035057
Synonyms:
(eltoprazine)1-(2,3-Dihydro-benzo[1,4]dioxin-5-yl)-piperazine CHEMBL282614 | Eltoprazine
Type:
Small organic molecule
Emp. Form.:
C12H16N2O2
Mol. Mass.:
220.2676
SMILES:
C1CN(CCN1)c1cccc2OCCOc12
: