Target
Delta-type opioid receptor
Ligand
BDBM50035057
Substrate
Ki
>10000±n/a nM
Comments
PDSP_779
Citation
 Schipper, JTulp, MTSijbesma, H Neurochemical profile of eltoprazine. Drug Metabol Drug Interact 8:85-114 (1990)  
Target
Name:
Delta-type opioid receptor
Synonyms:
Cytochrome P450 3A4 Delta opioid receptor Delta-type opioid receptor (DOR) OPRD_RAT Opioid receptor Opioid receptors; mu & delta Ror-a | Voltage-gated potassium channel
Type:
G Protein-Coupled Receptor (GPCR)
Mol. Mass.:
40465.04
Organism:
Rattus norvegicus (rat)
Description:
Competition binding assays were using CHO-K1 cell membranes expressing the opioid receptor.
Residue:
372
  
Inhibitor
Name:
BDBM50035057
Synonyms:
(eltoprazine)1-(2,3-Dihydro-benzo[1,4]dioxin-5-yl)-piperazine CHEMBL282614 | Eltoprazine
Type:
Small organic molecule
Emp. Form.:
C12H16N2O2
Mol. Mass.:
220.2676
SMILES:
C1CN(CCN1)c1cccc2OCCOc12
: