Target
Oxytocin receptor
Ligand
BDBM81895
Substrate
Ki
12±n/a nM
Comments
PDSP_1038
Citation
 Pettibone, DJClineschmidt, BVLis, EVReiss, DRTotaro, JAWoyden, CJBock, MGFreidinger, RMTung, RDVeber, DF In vitro pharmacological profile of a novel structural class of oxytocin antagonists. J Pharmacol Exp Ther 256:304-8 (1991) Target
Name:
Oxytocin receptor
Synonyms:
OXTR Oxytocin
Type:
Enzyme Catalytic Domain
Mol. Mass.:
42932.85
Organism:
Rhesus
Description:
Oxytocin OXTR Rhesus::P56494
Residue:
389
  
Inhibitor
Name:
BDBM81895
Synonyms:
Cyclo[L-Pro-D-Phe-L-Ile-1,6-didehydro-D-Pyz-1,6-didehydro-L-Pyz-N-methyl-L-Phe-] L-365,209
Type:
Small organic molecule
Emp. Form.:
C40H50N8O6
Mol. Mass.:
738.875
SMILES:
CCC(C)C1NC(=O)[C@H](Cc2ccccc2)NC(=O)[C@H]2CCCN2C(=O)[C@H](Cc2ccccc2)N(C)C(=O)[C@@H]2CCC=NN2C(=O)[C@H]2CCC=NN2C1=O
: