Target
Rat vasopressin-neurophysin
Ligand
BDBM81894
Substrate
Ki
1200±n/a nM
Comments
PDSP_1043
Citation
 Pettibone, DJClineschmidt, BVLis, EVReiss, DRTotaro, JAWoyden, CJBock, MGFreidinger, RMTung, RDVeber, DF In vitro pharmacological profile of a novel structural class of oxytocin antagonists. J Pharmacol Exp Ther 256:304-8 (1991) Target
Name:
Rat vasopressin-neurophysin
Synonyms:
Rat preprovasopressin-neurophysin | VASOPRESSIN V1
Type:
Enzyme Catalytic Domain
Mol. Mass.:
2826.33
Organism:
RAT
Description:
VASOPRESSIN V1 0 RAT::Q6LEI5
Residue:
26
  
Inhibitor
Name:
BDBM81894
Synonyms:
Cyclo[L-Pro-D-Trp-L-Ile-1,6-didehydro-D-Pyz-L-Pip-D-His-] L-366,875
Type:
Small organic molecule
Emp. Form.:
C39H50N10O6
Mol. Mass.:
754.8777
SMILES:
CC[C@H](C)[C@@H]1NC(=O)[C@@H](Cc2c[nH]c3ccccc23)NC(=O)[C@@H]2CCCN2C(=O)[C@@H](Cc2cnc[nH]2)NC(=O)[C@@H]2CCCCN2C(=O)[C@H]2CCC=NN2C1=O
: