Target
Vasopressin V2 receptor
Ligand
BDBM81893
Substrate
Ki
240±n/a nM
Comments
PDSP_1042
Citation
 Pettibone, DJClineschmidt, BVLis, EVReiss, DRTotaro, JAWoyden, CJBock, MGFreidinger, RMTung, RDVeber, DF In vitro pharmacological profile of a novel structural class of oxytocin antagonists. J Pharmacol Exp Ther 256:304-8 (1991) Target
Name:
Vasopressin V2 receptor
Synonyms:
AVPR V2 Avpr2 V2R_RAT Vasopressin receptor
Type:
G-protein coupled receptor
Mol. Mass.:
40761.85
Organism:
Rattus norvegicus (Rat)
Description:
Residue:
371
  
Inhibitor
Name:
BDBM81893
Synonyms:
CAS_3083084 NSC_3083084
Type:
Small organic molecule
Emp. Form.:
C43H56N8O6
Mol. Mass.:
780.9547
SMILES:
CCC(C)C(N)C(=O)N(C(Cc1c[nH]c2ccccc12)C=O)C(=O)C1CCCN1C(=O)C(CC1=CC=CCC1(C(=O)N1CCNCC1)C(=O)N1CC=CC=C1)NC
: