Target
D(2) dopamine receptor
Ligand
BDBM48320
Substrate
Ki
235±n/a nM
Comments
PDSP_1233
Citation
 Hall, HSällemark, MJerning, E Effects of remoxipride and some related new substituted salicylamides on rat brain receptors. Acta Pharmacol Toxicol (Copenh) 58:61-70 (1986)  
Target
Name:
D(2) dopamine receptor
Synonyms:
DOPAMINE D2 DOPAMINE D2 Short Dopamine D2 receptor Drd2
Type:
G Protein-Coupled Receptor (GPCR)
Mol. Mass.:
50931.60
Organism:
Rattus norvegicus (rat)
Description:
P61169
Residue:
444
  
Inhibitor
Name:
BDBM48320
Synonyms:
4-amino-5-chloro-N-[2-(diethylamino)ethyl]-2-methoxy-benzamide;hydrochloride 4-azanyl-5-chloranyl-N-[2-(diethylamino)ethyl]-2-methoxy-benzamide;hydrochloride METOCLOPRAMIDE HYDROCHLORIDE Metochloropramide US11147820, Compound Metoclopramide US9132134, Metoclopramide | cid_23659
Type:
Small organic molecule
Emp. Form.:
C14H22ClN3O2
Mol. Mass.:
299.796
SMILES:
CCN(CC)CCNC(=O)c1cc(Cl)c(N)cc1OC
: