Target
Adenosine receptor A2a
Ligand
BDBM50042210
Substrate
Ki
>10000±n/a nM
Comments
PDSP_2815
Citation
 Schwabe, UUkena, DLohse, MJ Xanthine derivatives as antagonists at A1 and A2 adenosine receptors. Naunyn Schmiedebergs Arch Pharmacol 330:212-21 (1985)  
Target
Name:
Adenosine receptor A2a
Synonyms:
A2A adenosine receptor (hA2A) ADENOSINE A2 ADORA2 Adenosine A2A receptor (A2AAR)
Type:
G Protein-Coupled Receptor (GPCR)
Mol. Mass.:
44716.46
Organism:
Homo sapiens (Human)
Description:
P29274
Residue:
412
  
Inhibitor
Name:
BDBM50042210
Synonyms:
1,7-dimethyl-3,7-dihydro-1H-purine-2,6-dione CHEMBL1158 | paraxanthine
Type:
Small organic molecule
Emp. Form.:
C7H8N4O2
Mol. Mass.:
180.164
SMILES:
Cn1cnc2[nH]c(=O)n(C)c(=O)c12
: