Target
Delta-type opioid receptor
Ligand
BDBM94503
Substrate
Ki
50±n/a nM
Comments
PDSP_1778
Citation
 Raynor, KKong, HChen, YYasuda, KYu, LBell, GIReisine, T Pharmacological characterization of the cloned kappa-, delta-, and mu-opioid receptors. Mol Pharmacol 45:330-4 (1994) Target
Name:
Delta-type opioid receptor
Synonyms:
D-OR-1 Delta opioid receptor OPIATE Delta OPRD1 OPRK1 | opioid receptor, delta 1
Type:
G Protein-Coupled Receptor (GPCR)
Mol. Mass.:
40382.98
Organism:
Homo sapiens (Human)
Description:
Competition binding assays were carried out using membrane preparations from transfected HN9.10 cells that constitutively expressed the delta opioid receptor.
Residue:
372
  
Inhibitor
Name:
BDBM94503
Synonyms:
2-hydroxypropane-1,2,3-tricarboxylic acid;N-[4-(methoxymethyl)-1-(2-thiophen-2-ylethyl)-4-piperidinyl]-N-phenylpropanamide MLS002320668 SMR001338814 Sufentanil citrate cid_65494 | citric acid;N-[4-(methoxymethyl)-1-[2-(2-thienyl)ethyl]-4-piperidyl]-N-phenyl-propionamide
Type:
Small organic molecule
Emp. Form.:
C22H30N2O2S
Mol. Mass.:
386.551
SMILES:
CCC(=O)N(c1ccccc1)C1(COC)CCN(CCc2cccs2)CC1
: