Target
Kappa-type opioid receptor
Ligand
BDBM82425
Substrate
Ki
0.13±n/a nM
Comments
PDSP_806
Citation
 Raynor, KKong, HChen, YYasuda, KYu, LBell, GIReisine, T Pharmacological characterization of the cloned kappa-, delta-, and mu-opioid receptors. Mol Pharmacol 45:330-4 (1994) Target
Name:
Kappa-type opioid receptor
Synonyms:
K-OR-1 Kappa-opioid receptor (KOR) Kappa-type opioid receptor (KOR) OPIATE Kappa OPRK1 kappa opioid receptor (KOR)
Type:
G Protein-Coupled Receptor (GPCR)
Mol. Mass.:
42648.76
Organism:
Homo sapiens (Human)
Description:
P41145
Residue:
380
  
Inhibitor
Name:
BDBM82425
Synonyms:
CAS_61677 NSC_61677
Type:
Small organic molecule
Emp. Form.:
C25H33NO4
Mol. Mass.:
411.5338
SMILES:
CCCC(C)(O)C1CC23C=CC1(OC)C1Oc4c5c(CC2N(C)CCC315)ccc4O
: