Target
Mu-type opioid receptor
Ligand
BDBM83436
Substrate
Ki
21±n/a nM
Comments
PDSP_1741
Citation
 Raynor, KKong, HChen, YYasuda, KYu, LBell, GIReisine, T Pharmacological characterization of the cloned kappa-, delta-, and mu-opioid receptors. Mol Pharmacol 45:330-4 (1994) Target
Name:
Mu-type opioid receptor
Synonyms:
M-OR-1 MOR-1 MUOR1 Mu opiate receptor OPRM1 hMOP | mu-type opioid receptor isoform MOR-1
Type:
G Protein-Coupled Receptor (GPCR)
Mol. Mass.:
44789.51
Organism:
Homo sapiens (Human)
Description:
P35372
Residue:
400
  
Inhibitor
Name:
BDBM83436
Synonyms:
2-(3,4-dichlorophenyl)-N-methyl-N-[(5R,7S,8S)-7-(1-pyrrolidinyl)-1-oxaspiro[4.5]decan-8-yl]acetamide;methanesulfonic acid 2-(3,4-dichlorophenyl)-N-methyl-N-[(5R,7S,8S)-7-pyrrolidin-1-yl-1-oxaspiro[4.5]decan-8-yl]ethanamide;methanesulfonic acid MLS002153429 Spiradoline cid_55651
Type:
Small organic molecule
Emp. Form.:
C22H30Cl2N2O2
Mol. Mass.:
425.392
SMILES:
CN([C@H]1CC[C@@]2(CCCO2)C[C@@H]1N1CCCC1)C(=O)Cc1ccc(Cl)c(Cl)c1
: