Target
Cytochrome P450 2C8
Ligand
BDBM50239251
Substrate
Meas. Tech.
ChEMBL_1665796 (CHEMBL4015592)
IC50
350±n/a nM
Citation
 Yeung, KSBeno, BRParcella, KBender, JAGrant-Young, KANickel, AGunaga, PAnjanappa, PBora, ROSelvakumar, KRigat, KWang, YKLiu, MLemm, JMosure, KSheriff, SWan, CWitmer, MKish, KHanumegowda, UZhuo, XShu, YZParker, DHaskell, RNg, AGao, QColston, ERaybon, JGrasela, DMSantone, KGao, MMeanwell, NASinz, MSoars, MGKnipe, JORoberts, SBKadow, JF Discovery of a Hepatitis C Virus NS5B Replicase Palm Site Allosteric Inhibitor (BMS-929075) Advanced to Phase 1 Clinical Studies. J Med Chem 60:4369-4385 (2017)  
Target
Name:
Cytochrome P450 2C8
Synonyms:
CP2C8_HUMAN CYPIIC8 P450 IIC2 P450 form 1 | S-mephenytoin 4-hydroxylase
Type:
Protein
Mol. Mass.:
55839.23
Organism:
Homo sapiens (Human)
Description:
P10632
Residue:
490
  
Inhibitor
Name:
BDBM50239251
Synonyms:
CHEMBL4096241
Type:
Small organic molecule
Emp. Form.:
C32H26FN3O3
Mol. Mass.:
519.5655
SMILES:
CNC(=O)c1c(oc2ccc(cc12)-c1cc(ccc1C)C(=O)NC1(CC1)c1cccnc1)-c1ccc(F)cc1
: