Target
D(2) dopamine receptor
Ligand
BDBM50000582
Substrate
Meas. Tech.
ChEMBL_62093 (CHEMBL674973)
Ki
1400±n/a nM
Citation
 Erickson, RHNatalie, KJBock, WLu, ZFarzin, FSherrill, RGMeloni, DJPatch, RJRzesotarski, WJClifton, J (Aminoalkoxy)chromones. Selective sigma receptor ligands. J Med Chem 35:1526-35 (1992)  
Target
Name:
D(2) dopamine receptor
Synonyms:
DOPAMINE D2 DOPAMINE D2 Short Dopamine D2 receptor Drd2
Type:
G Protein-Coupled Receptor (GPCR)
Mol. Mass.:
50931.60
Organism:
Rattus norvegicus (rat)
Description:
P61169
Residue:
444
  
Inhibitor
Name:
BDBM50000582
Synonyms:
6-(6-Piperidin-1-yl-hexyloxy)-2-thiophen-2-yl-chromen-4-one | CHEMBL36491
Type:
Small organic molecule
Emp. Form.:
C24H29NO3S
Mol. Mass.:
411.557
SMILES:
O=c1cc(oc2ccc(OCCCCCCN3CCCCC3)cc12)-c1cccs1
: