Target
D(2) dopamine receptor
Ligand
BDBM50000592
Substrate
Meas. Tech.
ChEMBL_62092 (CHEMBL674972)
Ki
4500±n/a nM
Citation
 Erickson, RHNatalie, KJBock, WLu, ZFarzin, FSherrill, RGMeloni, DJPatch, RJRzesotarski, WJClifton, J (Aminoalkoxy)chromones. Selective sigma receptor ligands. J Med Chem 35:1526-35 (1992)  
Target
Name:
D(2) dopamine receptor
Synonyms:
DOPAMINE D2 DOPAMINE D2 Short Dopamine D2 receptor Drd2
Type:
G Protein-Coupled Receptor (GPCR)
Mol. Mass.:
50931.60
Organism:
Rattus norvegicus (rat)
Description:
P61169
Residue:
444
  
Inhibitor
Name:
BDBM50000592
Synonyms:
2-Phenyl-6-(6-piperidin-1-yl-hexyloxy)-chromen-4-one | CHEMBL40676
Type:
Small organic molecule
Emp. Form.:
C26H31NO3
Mol. Mass.:
405.5292
SMILES:
O=c1cc(oc2ccc(OCCCCCCN3CCCCC3)cc12)-c1ccccc1
: