Target
D(2) dopamine receptor
Ligand
BDBM50000584
Substrate
Meas. Tech.
ChEMBL_62093 (CHEMBL674973)
Ki
2300±n/a nM
Citation
 Erickson, RHNatalie, KJBock, WLu, ZFarzin, FSherrill, RGMeloni, DJPatch, RJRzesotarski, WJClifton, J (Aminoalkoxy)chromones. Selective sigma receptor ligands. J Med Chem 35:1526-35 (1992)  
Target
Name:
D(2) dopamine receptor
Synonyms:
DOPAMINE D2 DOPAMINE D2 Short Dopamine D2 receptor Drd2
Type:
G Protein-Coupled Receptor (GPCR)
Mol. Mass.:
50931.60
Organism:
Rattus norvegicus (rat)
Description:
P61169
Residue:
444
  
Inhibitor
Name:
BDBM50000584
Synonyms:
2-Phenyl-6-(6-pyrrolidin-1-yl-hexyloxy)-chromen-4-one | CHEMBL40897
Type:
Small organic molecule
Emp. Form.:
C25H29NO3
Mol. Mass.:
391.5027
SMILES:
O=c1cc(oc2ccc(OCCCCCCN3CCCC3)cc12)-c1ccccc1
: