Target
Cytochrome P450 3A4
Ligand
BDBM50239940
Substrate
Meas. Tech.
ChEMBL_1667565 (CHEMBL4017361)
IC50
8400±n/a nM
Citation
 Zhou, SMahmoud, SLiu, PZhou, LEhteshami, MBassit, LTao, SDomaoal, RASari, OSchutter, CAmiralaei, SKhalil, AOllinger Russell, OMcBrayer, TWhitaker, TAbou-Taleb, NAmblard, FCoats, SJSchinazi, RF 2'-Chloro,2'-fluoro Ribonucleotide Prodrugs with Potent Pan-genotypic Activity against Hepatitis C Virus Replication in Culture. J Med Chem 60:5424-5437 (2017)  
Target
Name:
Cytochrome P450 3A4
Synonyms:
Albendazole monooxygenase CP3A4_HUMAN CYP3A4 CYPIIIA4 Cytochrome P450 3A4 (CYP3A4) Nifedipine oxidase Taurochenodeoxycholate 6-alpha-hydroxylase
Type:
Enzyme
Mol. Mass.:
57349.57
Organism:
Homo sapiens (Human)
Description:
Residue:
503
  
Inhibitor
Name:
BDBM50239940
Synonyms:
CHEBI:85083 Sofosbuvir | Sovaldi
Type:
Small organic molecule
Emp. Form.:
C22H29FN3O9P
Mol. Mass.:
529.4525
SMILES:
CC(C)OC(=O)[C@H](C)N[P@](=O)(OC[C@H]1O[C@@H](n2ccc(=O)[nH]c2=O)[C@](C)(F)[C@@H]1O)Oc1ccccc1
: