Target
Mu-type opioid receptor
Ligand
BDBM50000806
Substrate
Meas. Tech.
ChEBML_146421
IC50
1170±n/a nM
Citation
 Toth, GRussell, KCLandis, GKramer, THFang, LKnapp, RDavis, PBurks, TFYamamura, HIHruby, VJ Ring substituted and other conformationally constrained tyrosine analogues of [D-Pen2,D-Pen5]enkephalin with delta opioid receptor selectivity. J Med Chem 35:2384-91 (1992)  
Target
Name:
Mu-type opioid receptor
Synonyms:
MOR-1 Mu-type opioid receptor (MOR) OPRM_RAT Opioid receptor B Ror-b
Type:
G Protein-Coupled Receptor (GPCR)
Mol. Mass.:
44503.11
Organism:
Rattus norvegicus (rat)
Description:
Competition binding assays were carried out using membrane preparations from transfected HN9.10 cells that constitutively expressed the mu opioid receptor.
Residue:
398
  
Inhibitor
Name:
BDBM50000806
Synonyms:
13-[2-Amino-3-(4-hydroxy-2-methyl-phenyl)-propionylamino]-7-benzyl-3,3,14,14-tetramethyl-6,9,12-trioxo-1,2-dithia-5,8,11-triaza-cyclotetradecane-4-carboxylic acid | CHEMBL80648
Type:
Small organic molecule
Emp. Form.:
C31H41N5O7S2
Mol. Mass.:
659.817
SMILES:
Cc1cc(O)ccc1C[C@H](N)C(=O)N[C@H]1C(=O)NCC(=O)N[C@@H](Cc2ccccc2)C(=O)N[C@@H](C(O)=O)C(C)(C)SSC1(C)C
: