Target
Delta-type opioid receptor
Ligand
BDBM50001457
Substrate
Meas. Tech.
ChEBML_135591
IC50
919±n/a nM
Citation
 Schiller, PWWeltrowska, GNguyen, TMWilkes, BCChung, NNLemieux, C Conformationally restricted deltorphin analogues. J Med Chem 35:3956-61 (1992)  
Target
Name:
Delta-type opioid receptor
Synonyms:
DOR-1 MSL-2 OPRD_MOUSE Oprd1
Type:
Enzyme Catalytic Domain
Mol. Mass.:
40577.25
Organism:
MOUSE
Description:
P32300
Residue:
372
  
Inhibitor
Name:
BDBM50001457
Synonyms:
17-(2-{2-[2-Amino-3-(4-hydroxy-phenyl)-propionylamino]-acetylamino}-3-phenyl-propionylamino)-2,5-diisopropyl-3,6,14,18-tetraoxo-1,4,7,13tetraaza-cyclooctadecane-8-carboxylic acid amide | CHEMBL338985
Type:
Small organic molecule
Emp. Form.:
C41H59N9O9
Mol. Mass.:
821.9621
SMILES:
CC(C)[C@@H]1NC(=O)[C@H](NC(=O)[C@@H](CCC(=O)NCCCC[C@H](NC1=O)C(N)=O)NC(=O)[C@H](Cc1ccccc1)NC(=O)CNC(=O)[C@@H](N)Cc1ccc(O)cc1)C(C)C
: