Target
Beta-1 adrenergic receptor
Ligand
BDBM50001907
Substrate
Meas. Tech.
ChEBML_39159
IC50
540±n/a nM
Citation
 Phillips, GBMorgan, TKLumma, WCGomez, RPLind, JMLis, RArgentieri, TSullivan, ME Synthesis, cardiac electrophysiology, and beta-blocking activity of novel arylpiperazines with potential as class II/III antiarrhythmic agents. J Med Chem 35:743-50 (1992)  
Target
Name:
Beta-1 adrenergic receptor
Synonyms:
ADRB1 ADRB1_HUMAN Beta-1 adrenoceptor | adrenergic Beta1
Type:
G Protein-Coupled Receptor (GPCR)
Mol. Mass.:
51338.40
Organism:
Homo sapiens (Human)
Description:
P08588
Residue:
477
  
Inhibitor
Name:
BDBM50001907
Synonyms:
4-Imidazol-1-yl-N-(4-phenyl-piperazin-2-ylmethyl)-benzamide | CHEMBL350847
Type:
Small organic molecule
Emp. Form.:
C21H23N5O
Mol. Mass.:
361.4402
SMILES:
O=C(NCC1CN(CCN1)c1ccccc1)c1ccc(cc1)-n1ccnc1
: