Target
Beta-2 adrenergic receptor
Ligand
BDBM50001896
Substrate
Meas. Tech.
ChEBML_37833
IC50
6200±n/a nM
Citation
 Phillips, GBMorgan, TKLumma, WCGomez, RPLind, JMLis, RArgentieri, TSullivan, ME Synthesis, cardiac electrophysiology, and beta-blocking activity of novel arylpiperazines with potential as class II/III antiarrhythmic agents. J Med Chem 35:743-50 (1992)  
Target
Name:
Beta-2 adrenergic receptor
Synonyms:
ADRB2 | ADRB2_CANLF
Type:
PROTEIN
Mol. Mass.:
46593.67
Organism:
Canis familiaris
Description:
ChEMBL_56504
Residue:
415
  
Inhibitor
Name:
BDBM50001896
Synonyms:
CHEMBL165901 | N-(4-Phenyl-piperazin-2-ylmethyl)-benzamide
Type:
Small organic molecule
Emp. Form.:
C18H21N3O
Mol. Mass.:
295.3788
SMILES:
O=C(NCC1CN(CCN1)c1ccccc1)c1ccccc1
: