Target
Beta-2 adrenergic receptor
Ligand
BDBM50001910
Substrate
Meas. Tech.
ChEBML_37833
IC50
4300±n/a nM
Citation
 Phillips, GBMorgan, TKLumma, WCGomez, RPLind, JMLis, RArgentieri, TSullivan, ME Synthesis, cardiac electrophysiology, and beta-blocking activity of novel arylpiperazines with potential as class II/III antiarrhythmic agents. J Med Chem 35:743-50 (1992)  
Target
Name:
Beta-2 adrenergic receptor
Synonyms:
ADRB2 | ADRB2_CANLF
Type:
PROTEIN
Mol. Mass.:
46593.67
Organism:
Canis familiaris
Description:
ChEMBL_56504
Residue:
415
  
Inhibitor
Name:
BDBM50001910
Synonyms:
4-(Methanesulfonyl-methyl-amino)-N-(4-phenyl-piperazin-2-ylmethyl)-benzamide | CHEMBL162200
Type:
Small organic molecule
Emp. Form.:
C20H26N4O3S
Mol. Mass.:
402.51
SMILES:
CN(c1ccc(cc1)C(=O)NCC1CN(CCN1)c1ccccc1)S(C)(=O)=O
: