Target
Metabotropic glutamate receptor 4
Ligand
BDBM50241548
Substrate
Meas. Tech.
ChEMBL_1669926 (CHEMBL4019814)
EC50
280±n/a nM
Citation
 Charvin, DPomel, VOrtiz, MFrauli, MScheffler, SSteinberg, EBaron, LDeshons, LRudigier, RThiarc, DMorice, CManteau, BMayer, SGraham, DGiethlen, BBrugger, NHédou, GConquet, FSchann, S Discovery, Structure-Activity Relationship, and Antiparkinsonian Effect of a Potent and Brain-Penetrant Chemical Series of Positive Allosteric Modulators of Metabotropic Glutamate Receptor 4. J Med Chem 60:8515-8537 (2017)  
Target
Name:
Metabotropic glutamate receptor 4
Synonyms:
GPRC1D GRM4_HUMAN MGLUR4 Metabotropic glutamate receptor 4 (mGlu4) metabotropic glutamate 4
Type:
Protein
Mol. Mass.:
101899.95
Organism:
Homo sapiens (Human)
Description:
Q14833
Residue:
912
  
Inhibitor
Name:
BDBM50241548
Synonyms:
CHEMBL4089473
Type:
Small organic molecule
Emp. Form.:
C16H11N3O2
Mol. Mass.:
277.2774
SMILES:
O\N=c1/cc(oc2ccccc12)-c1cn2cccc2cn1
: