Target
Integrin alpha-IIb/beta-3
Ligand
BDBM50003319
Substrate
Meas. Tech.
ChEBML_158684
IC50
90±n/a nM
Citation
 Peishoff, CEAli, FEBean, JWCalvo, RD'Ambrosio, CAEggleston, DSHwang, SMKline, TPKoster, PFNichols, A Investigation of conformational specificity at GPIIb/IIIa: evaluation of conformationally constrained RGD peptides. J Med Chem 35:3962-9 (1992)  
Target
Name:
Integrin alpha-IIb/beta-3
Synonyms:
Glycoprotein IIb/IIIa
Type:
Mol. Mass.:
Description:
ASSAY_ID of EBI is 30109
Components:
This complex has 2 components.
Component 1
Name:
Integrin beta-3
Synonyms:
CD_antigen=CD61 GPIIIa ITGB3 Platelet membrane glycoprotein IIIa
Type:
Protein
Mol. Mass.:
87038.91
Organism:
Homo sapiens (Human)
Description:
P05106
Residue:
788
  
Component 2
Name:
Integrin alpha-IIb
Synonyms:
CD_antigen=CD41 GPIIb Glycoprotein IIb ITGA2B Integrin alpha-IIb heavy chain Integrin alpha-IIb light chain, form 2 Integrin alpha-V/beta-3 and alpha-IIb/beta 3 | Platelet membrane glycoprotein IIb
Type:
Protein
Mol. Mass.:
113354.85
Organism:
Homo sapiens (Human)
Description:
P08514
Residue:
1039
  
Inhibitor
Name:
BDBM50003319
Synonyms:
3-(2-{5-Guanidino-2-[(2-mercapto-benzoyl)-methyl-amino]-pentanoylamino}-acetylamino)-N-(2-mercapto-phenyl)-succinamic acid(Mba-(N-Me)Arg-Gly-Asp-Man) | CHEMBL132216
Type:
Small organic molecule
Emp. Form.:
C26H33N7O6S2
Mol. Mass.:
603.714
SMILES:
CN([C@@H](CCCNC(N)=N)C(=O)NCC(=O)N[C@@H](CC(O)=O)C(=O)Nc1ccccc1S)C(=O)c1ccccc1S
: