Target
Sigma non-opioid intracellular receptor 1
Ligand
BDBM50003753
Substrate
Meas. Tech.
ChEBML_201725
Ki
1.3±n/a nM
Citation
 de Costa, BRDominguez, CHe, XSWilliams, WRadesca, LBowen, W Synthesis and biological evaluation of conformationally restricted 2-(1-pyrrolidinyl)-N-[2-(3,4-dichlorophenyl)ethyl]-N-methylethylenediam ines as sigma receptor ligands. 1. Pyrrolidine, piperidine, homopiperidine, and tetrahydroisoquinoline classes. J Med Chem 35:4334-43 (1992)  
Target
Name:
Sigma non-opioid intracellular receptor 1
Synonyms:
Aging-associated gene 8 protein SGMR1_HUMAN SIGMAR1 SR31747-binding protein Sigma 1-type opioid receptor Sigma1R | hSigmaR1
Type:
Enzyme Catalytic Domain
Mol. Mass.:
25124.85
Organism:
Homo sapiens (Human)
Description:
Q99720
Residue:
223
  
Inhibitor
Name:
BDBM50003753
Synonyms:
6,7-Dichloro-2-(2-pyrrolidin-1-yl-ethyl)-1,2,3,4-tetrahydro-isoquinoline | CHEMBL134313
Type:
Small organic molecule
Emp. Form.:
C15H20Cl2N2
Mol. Mass.:
299.239
SMILES:
Clc1cc2CCN(CCN3CCCC3)Cc2cc1Cl
: