Target
Acetylcholinesterase
Ligand
BDBM50004010
Substrate
Meas. Tech.
ChEBML_28911
IC50
3000±n/a nM
Citation
 Sugimoto, HTsuchiya, YSugumi, HHigurashi, KKaribe, NIimura, YSasaki, AAraki, SYamanishi, YYamatsu, K Synthesis and structure-activity relationships of acetylcholinesterase inhibitors: 1-benzyl-4-(2-phthalimidoethyl)piperidine and related derivatives. J Med Chem 35:4542-8 (1993)  
Target
Name:
Acetylcholinesterase
Synonyms:
ACES_MOUSE Acetylcholinesterase (mouse AChE) Ache
Type:
Enzyme
Mol. Mass.:
68165.65
Organism:
Mus musculus (mouse)
Description:
Residue:
614
  
Inhibitor
Name:
BDBM50004010
Synonyms:
2-((1-benzylpiperidin-4-yl)methyl)-5-nitroisoindoline-1,3-dione CHEMBL326868
Type:
Small organic molecule
Emp. Form.:
C21H21N3O4
Mol. Mass.:
379.4091
SMILES:
[O-][N+](=O)c1ccc2C(=O)N(CC3CCN(Cc4ccccc4)CC3)C(=O)c2c1
: