Target
Acetylcholinesterase
Ligand
BDBM50004041
Substrate
Meas. Tech.
ChEBML_28911
IC50
240±n/a nM
Citation
 Sugimoto, HTsuchiya, YSugumi, HHigurashi, KKaribe, NIimura, YSasaki, AAraki, SYamanishi, YYamatsu, K Synthesis and structure-activity relationships of acetylcholinesterase inhibitors: 1-benzyl-4-(2-phthalimidoethyl)piperidine and related derivatives. J Med Chem 35:4542-8 (1993)  
Target
Name:
Acetylcholinesterase
Synonyms:
ACES_MOUSE Acetylcholinesterase (mouse AChE) Ache
Type:
Enzyme
Mol. Mass.:
68165.65
Organism:
Mus musculus (mouse)
Description:
Residue:
614
  
Inhibitor
Name:
BDBM50004041
Synonyms:
2-(2-(1-(4-chlorobenzyl)piperidin-4-yl)ethyl)-5-nitroisoindoline-1,3-dione CHEMBL123909
Type:
Small organic molecule
Emp. Form.:
C22H22ClN3O4
Mol. Mass.:
427.881
SMILES:
[O-][N+](=O)c1ccc2C(=O)N(CCC3CCN(Cc4ccc(Cl)cc4)CC3)C(=O)c2c1
: