Target
Neutrophil elastase
Ligand
BDBM50004186
Substrate
Meas. Tech.
ChEBML_63655
pH
7.5±n/a
IC50
>5000±n/a nM
Comments
extracted
Citation
 Skiles, JWMiao, CSorcek, RJacober, SMui, PWChow, GWeldon, SMPossanza, GSkoog, MKeirns, J Inhibition of human leukocyte elastase by N-substituted peptides containing alpha,alpha-difluorostatone residues at P1. J Med Chem 35:4795-808 (1993)  
Target
Name:
Neutrophil elastase
Synonyms:
Bone marrow serine protease Coagulation factor X ELANE Elastase HLE Leukocyte elastase Medullasin Neutrophil elastase (HNE) PMN elastase Trypsin
Type:
Enzyme
Mol. Mass.:
28532.38
Organism:
Homo sapiens (Human)
Description:
P08246
Residue:
267
  
Inhibitor
Name:
BDBM50004186
Synonyms:
4-{2-[(2-Benzyloxycarbonylamino-3-methyl-butyryl)-indan-2-yl-amino]-acetylamino}-2,2-difluoro-5-methyl-3-oxo-hexanoic acid | CHEMBL144895
Type:
Small organic molecule
Emp. Form.:
C31H37F2N3O7
Mol. Mass.:
601.6382
SMILES:
CC(C)C(NC(=O)OCc1ccccc1)C(=O)N(CC(=O)NC(C(C)C)C(=O)C(F)(F)C(O)=O)C1Cc2ccccc2C1
: