Target
Gastrin/cholecystokinin type B receptor
Ligand
BDBM50004486
Substrate
Meas. Tech.
ChEBML_47826
IC50
16±n/a nM
Citation
 Holladay, MWBennett, MJTufano, MDLin, CWAsin, KEWitte, DGMiller, TRBianchi, BRNikkel, ALBednarz, L Synthesis and biological activity of CCK heptapeptide analogues. Effects of conformational constraints and standard modifications on receptor subtype selectivity, functional activity in vitro, and appetite suppression in vivo. J Med Chem 35:2919-28 (1992)  
Target
Name:
Gastrin/cholecystokinin type B receptor
Synonyms:
CCK-2 receptor CCK-BR CCKRB Cholecystokinin receptor GASR_HUMAN | Gastrin/cholecystokinin type B receptor
Type:
G Protein-Coupled Receptor (GPCR)
Mol. Mass.:
48445.79
Organism:
Homo sapiens (Human)
Description:
Stable expression of human CCK-2 receptors in HEK 293 cells.
Residue:
447
  
Inhibitor
Name:
BDBM50004486
Synonyms:
CCK7 analogue | CHEMBL316709
Type:
Small organic molecule
Emp. Form.:
C47H58N8O13S
Mol. Mass.:
975.074
SMILES:
CCCC[C@H](NC(=O)CCc1ccc(OS(O)(=O)=O)cc1)C(=O)NCC(=O)N[C@@H](Cc1c[nH]c2ccccc12)C(=O)N1CCC[C@H]1C(=O)N[C@@H](CC(O)=O)C(=O)N(C)[C@@H](Cc1ccccc1)C(N)=O
: