Target
Gag-Pol polyprotein [489-587]
Ligand
BDBM50004603
Substrate
Meas. Tech.
ChEBML_159622
IC50
>55000±n/a nM
Citation
 Humber, DCCammack, NCoates, JACobley, KNOrr, DCStorer, RWeingarten, GGWeir, MP Penicillin derived C2-symmetric dimers as novel inhibitors of HIV-1 proteinase. J Med Chem 35:3080-1 (1992)  
Target
Name:
Gag-Pol polyprotein [489-587]
Synonyms:
Human immunodeficiency virus type 1 protease Pol polyprotein | gag-pol
Type:
Enzyme Subunit
Mol. Mass.:
10781.16
Organism:
Human immunodeficiency virus type 1
Description:
P04585[489-587]
Residue:
99
  
Inhibitor
Name:
BDBM50004603
Synonyms:
CHEMBL105589 | [4-(2-Acetylamino-ethylcarbamoyl)-5,5-dimethyl-thiazolidin-2-yl]-phenylacetylamino-acetic acid methyl ester
Type:
Small organic molecule
Emp. Form.:
C21H30N4O5S
Mol. Mass.:
450.552
SMILES:
COC(=O)[C@@H](NC(=O)Cc1ccccc1)[C@@H]1N[C@@H](C(=O)NCCNC(C)=O)C(C)(C)S1
: