Target
D(2) dopamine receptor
Ligand
BDBM50004811
Substrate
Meas. Tech.
ChEBML_63062
Ki
0.213000±n/a nM
Citation
 Mach, RHJackson, JRLuedtke, RRIvins, KJMolinoff, PBEhrenkaufer, RL Effect of N-alkylation on the affinities of analogues of spiperone for dopamine D2 and serotonin 5-HT2 receptors. J Med Chem 35:423-30 (1992)  
Target
Name:
D(2) dopamine receptor
Synonyms:
DOPAMINE D2 DOPAMINE D2 Short Dopamine D2 receptor Drd2
Type:
G Protein-Coupled Receptor (GPCR)
Mol. Mass.:
50931.60
Organism:
Rattus norvegicus (rat)
Description:
P61169
Residue:
444
  
Inhibitor
Name:
BDBM50004811
Synonyms:
8-[4-(4-Fluoro-phenyl)-4-oxo-butyl]-3-(4-iodo-benzyl)-1-phenyl-1,3,8-triaza-spiro[4.5]decan-4-one | CHEMBL335714
Type:
Small organic molecule
Emp. Form.:
C30H31FIN3O2
Mol. Mass.:
611.4889
SMILES:
Fc1ccc(cc1)C(=O)CCCN1CCC2(CC1)N(CN(Cc1ccc(I)cc1)C2=O)c1ccccc1
: