Target
D(2) dopamine receptor
Ligand
BDBM50004812
Substrate
Meas. Tech.
ChEBML_63062
Ki
0.087000±n/a nM
Citation
 Mach, RHJackson, JRLuedtke, RRIvins, KJMolinoff, PBEhrenkaufer, RL Effect of N-alkylation on the affinities of analogues of spiperone for dopamine D2 and serotonin 5-HT2 receptors. J Med Chem 35:423-30 (1992)  
Target
Name:
D(2) dopamine receptor
Synonyms:
DOPAMINE D2 DOPAMINE D2 Short Dopamine D2 receptor Drd2
Type:
G Protein-Coupled Receptor (GPCR)
Mol. Mass.:
50931.60
Organism:
Rattus norvegicus (rat)
Description:
P61169
Residue:
444
  
Inhibitor
Name:
BDBM50004812
Synonyms:
8-[4-(4-Fluoro-phenyl)-4-oxo-butyl]-3-(4-methoxy-benzyl)-1-phenyl-1,3,8-triaza-spiro[4.5]decan-4-one | CHEMBL335606
Type:
Small organic molecule
Emp. Form.:
C31H34FN3O3
Mol. Mass.:
515.6184
SMILES:
COc1ccc(CN2CN(c3ccccc3)C3(CCN(CCCC(=O)c4ccc(F)cc4)CC3)C2=O)cc1
: