Target
Renin
Ligand
BDBM50005435
Substrate
Meas. Tech.
ChEBML_192717
IC50
>1000±n/a nM
Citation
 Repine, JTKaltenbronn, JSDoherty, AMHamby, JMHimmelsbach, RJKornberg, BETaylor, MDLunney, EAHumblet, CRapundalo, ST Renin inhibitors containing alpha-heteroatom amino acids as P2 residues. J Med Chem 35:1032-42 (1992)  
Target
Name:
Renin
Synonyms:
Angiotensinogenase RENI_HUMAN
Type:
Enzyme
Mol. Mass.:
45058.99
Organism:
Homo sapiens (Human)
Description:
Residue:
406
  
Inhibitor
Name:
BDBM50005435
Synonyms:
4-[2-Amino-2-(3-naphthalen-1-yl-2-naphthalen-1-ylmethyl-propionylamino)-acetylamino]-3-hydroxy-6-methyl-heptanoic acid (2-methyl-butyl)-amide | CHEMBL3350027
Type:
Small organic molecule
Emp. Form.:
C39H50N4O4
Mol. Mass.:
638.8387
SMILES:
CC[C@H](C)CNC(=O)C[C@H](O)[C@H](CC(C)C)NC(=O)C(N)NC(=O)C(Cc1cccc2ccccc12)Cc1cccc2ccccc12
: