Target
Renin
Ligand
BDBM50005426
Substrate
Meas. Tech.
ChEBML_192717
IC50
>1000±n/a nM
Citation
 Repine, JTKaltenbronn, JSDoherty, AMHamby, JMHimmelsbach, RJKornberg, BETaylor, MDLunney, EAHumblet, CRapundalo, ST Renin inhibitors containing alpha-heteroatom amino acids as P2 residues. J Med Chem 35:1032-42 (1992)  
Target
Name:
Renin
Synonyms:
Angiotensinogenase RENI_HUMAN
Type:
Enzyme
Mol. Mass.:
45058.99
Organism:
Homo sapiens (Human)
Description:
Residue:
406
  
Inhibitor
Name:
BDBM50005426
Synonyms:
4-[2-Ethylamino-2-(3-naphthalen-1-yl-2-naphthalen-1-ylmethyl-propionylamino)-acetylamino]-3-hydroxy-6-methyl-heptanoic acid (2-methyl-butyl)-amide | CHEMBL3350021
Type:
Small organic molecule
Emp. Form.:
C41H54N4O4
Mol. Mass.:
666.8919
SMILES:
CCNC(NC(=O)C(Cc1cccc2ccccc12)Cc1cccc2ccccc12)C(=O)N[C@@H](CC(C)C)[C@@H](O)CC(=O)NC[C@@H](C)CC
: