Target
Renin
Ligand
BDBM50005418
Substrate
Meas. Tech.
ChEBML_192717
IC50
5.3±n/a nM
Citation
 Repine, JTKaltenbronn, JSDoherty, AMHamby, JMHimmelsbach, RJKornberg, BETaylor, MDLunney, EAHumblet, CRapundalo, ST Renin inhibitors containing alpha-heteroatom amino acids as P2 residues. J Med Chem 35:1032-42 (1992)  
Target
Name:
Renin
Synonyms:
Angiotensinogenase RENI_HUMAN
Type:
Enzyme
Mol. Mass.:
45058.99
Organism:
Homo sapiens (Human)
Description:
Residue:
406
  
Inhibitor
Name:
BDBM50005418
Synonyms:
5-Cyclohexyl-4-{2-ethoxy-2-[2-(morpholine-4-sulfonylamino)-3-phenyl-propionylamino]-acetylamino}-3-hydroxy-pentanoic acid (2-morpholin-4-yl-ethyl)-amide | CHEMBL267042
Type:
Small organic molecule
Emp. Form.:
C34H56N6O9S
Mol. Mass.:
724.908
SMILES:
CCOC(NC(=O)[C@H](Cc1ccccc1)NS(=O)(=O)N1CCOCC1)C(=O)N[C@@H](CC1CCCCC1)[C@@H](O)CC(=O)NCCN1CCOCC1
: