Target
Cathepsin D
Ligand
BDBM50005420
Substrate
Meas. Tech.
ChEBML_44969
IC50
>10000±n/a nM
Citation
 Repine, JTKaltenbronn, JSDoherty, AMHamby, JMHimmelsbach, RJKornberg, BETaylor, MDLunney, EAHumblet, CRapundalo, ST Renin inhibitors containing alpha-heteroatom amino acids as P2 residues. J Med Chem 35:1032-42 (1992)  
Target
Name:
Cathepsin D
Synonyms:
CATD_BOVIN | CTSD
Type:
PROTEIN
Mol. Mass.:
42158.92
Organism:
Bos taurus
Description:
ChEMBL_1458606
Residue:
387
  
Inhibitor
Name:
BDBM50005420
Synonyms:
5-Cyclohexyl-3-hydroxy-4-{3-(1H-imidazol-4-yl)-2-[2-(morpholine-4-sulfonylamino)-3-phenyl-propionylamino]-propionylamino}-pentanoic acid (2-morpholin-4-yl-ethyl)-amide | CHEMBL276372
Type:
Small organic molecule
Emp. Form.:
C36H56N8O8S
Mol. Mass.:
760.944
SMILES:
O[C@@H](CC(=O)NCCN1CCOCC1)[C@H](CC1CCCCC1)NC(=O)C(Cc1cnc[nH]1)NC(=O)[C@H](Cc1ccccc1)NS(=O)(=O)N1CCOCC1
: