Target
Renin
Ligand
BDBM50006132
Substrate
Meas. Tech.
ChEBML_195926
pH
6±n/a
IC50
2.4±n/a nM
Comments
extracted
Citation
 Martin, SFAustin, REOalmann, CJBaker, WRCondon, SLdeLara, ERosenberg, SHSpina, KPStein, HHCohen, J 1,2,3-trisubstituted cyclopropanes as conformationally restricted peptide isosteres: application to the design and synthesis of novel renin inhibitors. J Med Chem 35:1710-21 (1992)  
Target
Name:
Renin
Synonyms:
Angiotensinogenase RENI_HUMAN
Type:
Enzyme
Mol. Mass.:
45058.99
Organism:
Homo sapiens (Human)
Description:
Residue:
406
  
Inhibitor
Name:
BDBM50006132
Synonyms:
CHEMBL297929 | [1-[1-(1-Cyclohexylmethyl-2,3-dihydroxy-5-methyl-hexylcarbamoyl)-3-methyl-butylcarbamoyl]-2-(4-iodo-phenyl)-ethyl]-carbamic acid ethyl ester
Type:
Small organic molecule
Emp. Form.:
C32H52IN3O6
Mol. Mass.:
701.6763
SMILES:
CCOC(=O)N[C@@H](Cc1ccc(I)cc1)C(=O)N[C@@H](CC(C)C)C(=O)N[C@@H](CC1CCCCC1)[C@@H](O)[C@@H](O)CC(C)C
: