Target
Renin
Ligand
BDBM50006146
Substrate
Meas. Tech.
ChEMBL_195794 (CHEMBL802394)
pH
6±n/a
IC50
160±n/a nM
Comments
extracted
Citation
 Baker, WRFung, AKKleinert, HDStein, HHPlattner, JJArmiger, YLCondon, SLCohen, JEgan, DABarlow, JL Nonpeptide renin inhibitors employing a novel 3-aza(or oxa)-2,4-dialkyl glutaric acid moiety as a P2/P3 amide bond replacement. J Med Chem 35:1722-34 (1992)  
Target
Name:
Renin
Synonyms:
Angiotensinogenase RENI_HUMAN
Type:
Enzyme
Mol. Mass.:
45058.99
Organism:
Homo sapiens (Human)
Description:
Residue:
406
  
Inhibitor
Name:
BDBM50006146
Synonyms:
2-[1-(1-Cyclohexylmethyl-2,3-dihydroxy-5-methyl-hexylcarbamoyl)-3-methyl-butylamino]-4-phenyl-butyric acid ethyl ester | CHEMBL46271
Type:
Small organic molecule
Emp. Form.:
C32H54N2O5
Mol. Mass.:
546.7816
SMILES:
CCOC(=O)C(CCc1ccccc1)N[C@@H](CC(C)C)C(=O)N[C@@H](CC1CCCCC1)[C@@H](O)[C@@H](O)CC(C)C
: