Target
Renin
Ligand
BDBM50006147
Substrate
Meas. Tech.
ChEMBL_195793 (CHEMBL802393)
pH
7.4±n/a
IC50
120±n/a nM
Comments
extracted
Citation
 Baker, WRFung, AKKleinert, HDStein, HHPlattner, JJArmiger, YLCondon, SLCohen, JEgan, DABarlow, JL Nonpeptide renin inhibitors employing a novel 3-aza(or oxa)-2,4-dialkyl glutaric acid moiety as a P2/P3 amide bond replacement. J Med Chem 35:1722-34 (1992)  
Target
Name:
Renin
Synonyms:
Angiotensinogenase RENI_HUMAN
Type:
Enzyme
Mol. Mass.:
45058.99
Organism:
Homo sapiens (Human)
Description:
Residue:
406
  
Inhibitor
Name:
BDBM50006147
Synonyms:
2-[1-Benzyl-2-(4-methoxymethoxy-piperidin-1-yl)-2-oxo-ethoxy]-N-(1-cyclohexylmethyl-2,3-dihydroxy-5-methyl-hexyl)-butyramide | CHEMBL49864
Type:
Small organic molecule
Emp. Form.:
C34H56N2O7
Mol. Mass.:
604.8176
SMILES:
CC[C@H](O[C@@H](Cc1ccccc1)C(=O)N1CCC(CC1)OCOC)C(=O)N[C@@H](CC1CCCCC1)[C@@H](O)[C@@H](O)CC(C)C
: