Target
Renin
Ligand
BDBM50006162
Substrate
Meas. Tech.
ChEMBL_195793 (CHEMBL802393)
pH
7.4±n/a
IC50
3700±n/a nM
Comments
extracted
Citation
 Baker, WRFung, AKKleinert, HDStein, HHPlattner, JJArmiger, YLCondon, SLCohen, JEgan, DABarlow, JL Nonpeptide renin inhibitors employing a novel 3-aza(or oxa)-2,4-dialkyl glutaric acid moiety as a P2/P3 amide bond replacement. J Med Chem 35:1722-34 (1992)  
Target
Name:
Renin
Synonyms:
Angiotensinogenase RENI_HUMAN
Type:
Enzyme
Mol. Mass.:
45058.99
Organism:
Homo sapiens (Human)
Description:
Residue:
406
  
Inhibitor
Name:
BDBM50006162
Synonyms:
2-(1-Benzyl-2-oxo-2-pyrrolidin-1-yl-ethoxy)-N-(1-cyclohexylmethyl-2,3-dihydroxy-5-methyl-hexyl)-propionamide | CHEMBL49592
Type:
Small organic molecule
Emp. Form.:
C30H48N2O5
Mol. Mass.:
516.7125
SMILES:
CC(C)C[C@H](O)[C@H](O)[C@H](CC1CCCCC1)NC(=O)[C@H](C)O[C@@H](Cc1ccccc1)C(=O)N1CCCC1
: