Target
Renin
Ligand
BDBM50006213
Substrate
Meas. Tech.
ChEBML_195919
pH
6±n/a
IC50
12±n/a nM
Comments
extracted
Citation
 Boyd, SAFung, AKBaker, WRMantei, RAArmiger, YLStein, HHCohen, JEgan, DABarlow, JLKlinghofer, V C-terminal modifications of nonpeptide renin inhibitors: improved oral bioavailability via modification of physicochemical properties. J Med Chem 35:1735-46 (1992)  
Target
Name:
Renin
Synonyms:
Angiotensinogenase RENI_HUMAN
Type:
Enzyme
Mol. Mass.:
45058.99
Organism:
Homo sapiens (Human)
Description:
Residue:
406
  
Inhibitor
Name:
BDBM50006213
Synonyms:
CHEMBL48343 | {4-[2-(2-tert-Butoxycarbonylamino-3-phenyl-propionylamino)-3-(1H-imidazol-4-yl)-propionylamino]-5-cyclohexyl-3-hydroxy-1-isopropyl-pentyl}-carbamic acid 2-dimethylamino-ethyl ester
Type:
Small organic molecule
Emp. Form.:
C39H63N7O7
Mol. Mass.:
741.9602
SMILES:
CC(C)[C@H](C[C@H](O)[C@H](CC1CCCCC1)NC(=O)[C@H](Cc1cnc[nH]1)NC(=O)[C@H](Cc1ccccc1)NC(=O)OC(C)(C)C)NC(=O)OCCN(C)C
: