Target
Beta-2 adrenergic receptor
Ligand
BDBM50006958
Substrate
Meas. Tech.
ChEMBL_38462 (CHEMBL652419)
Ki
1181±n/a nM
Citation
 Russo, FRomeo, GGuccione, SDe Blasi, A Pyrimido[5,4-b]indole derivatives. 1. A new class of potent and selective alpha 1 adrenoceptor ligands. J Med Chem 34:1850-4 (1991)  
Target
Name:
Beta-2 adrenergic receptor
Synonyms:
ADRB2 ADRB2_HUMAN Beta-2 adrenoceptor | Beta-2 adrenoreceptor
Type:
Mol. Mass.:
46461.69
Organism:
Homo sapiens (Human)
Description:
P07550
Residue:
413
  
Inhibitor
Name:
BDBM50006958
Synonyms:
2-{3-[4-(2-Methoxy-phenyl)-piperazin-1-yl]-propyl}-4,9-dihydro-2,4,9-triaza-fluorene-1,3-dione | CHEMBL55528
Type:
Small organic molecule
Emp. Form.:
C24H27N5O3
Mol. Mass.:
433.5029
SMILES:
COc1ccccc1N1CCN(CCCn2c(=O)[nH]c3c4ccccc4[nH]c3c2=O)CC1
: