Target
D(2) dopamine receptor
Ligand
BDBM50007562
Substrate
Meas. Tech.
ChEMBL_58695 (CHEMBL672661)
IC50
72±n/a nM
Citation
 Lowe, JASeeger, TFNagel, AAHoward, HRSeymour, PAHeym, JHEwing, FENewman, MESchmidt, AWFurman, JS 1-Naphthylpiperazine derivatives as potential atypical antipsychotic agents. J Med Chem 34:1860-6 (1991)  
Target
Name:
D(2) dopamine receptor
Synonyms:
DOPAMINE D2 DOPAMINE D2 Short Dopamine D2 receptor Drd2
Type:
G Protein-Coupled Receptor (GPCR)
Mol. Mass.:
50931.60
Organism:
Rattus norvegicus (rat)
Description:
P61169
Residue:
444
  
Inhibitor
Name:
BDBM50007562
Synonyms:
4-{4-[2-(4-Naphthalen-1-yl-piperazin-1-yl)-ethyl]-phenyl}-thiazol-2-ylamine | CHEMBL300849
Type:
Small organic molecule
Emp. Form.:
C25H26N4S
Mol. Mass.:
414.566
SMILES:
Nc1nc(cs1)-c1ccc(CCN2CCN(CC2)c2cccc3ccccc23)cc1
: